{"text_format":"1","workbook":"xlsx","n_sheets":12,"sheets":["PISA JUNIO 2019","ANEXO AySA NOTAS MONTOS","POR JURISDICCION","Total de obras","Resumen total","Estado Nacional","Provincia","CABA","ACUMAR","Hoja1","CLASIFICACIÓN MANUAL","Resumen por LA"],"not_rendered":{"charts":0,"images":3,"macros":1,"external_links":11,"defined_names":445,"comments":0,"pivot_tables":2},"unopened":[],"bounds":{"document_bytes":16777216,"sheet_cells":100000,"rows_first":2000,"rows_last":500,"rows_between":2000,"halvings":0,"cell_chars":16384,"cell_head_chars":4096},"cells_cut":0,"cells_raw":0,"read":"whole","date_system":"1900"}

{"sheet":"PISA JUNIO 2019","index":0,"n_rows":29,"n_cols":8,"rows_kept":29,"cut":false,"hidden":true,"merged":[[3,0,3,6],[9,0,9,6]]}
[" "]
[null,null,null," "]
[null,null,null," "]
[]
[]
[null,null,null,null,null,null," "]
[null,null,null,null," ",null,null," "]
[]
[]
[]
[]
[]
[]
[]
[]
{"$rows_left_out":15}
{"sheet":"ANEXO AySA NOTAS MONTOS","index":1,"n_rows":122,"n_cols":11,"rows_kept":122,"cut":false,"hidden":true,"merged":[[4,0,7,0],[8,0,13,0],[14,0,20,0],[21,0,28,0],[30,0,31,0],[30,1,31,1],[30,2,31,6],[33,0,34,0],[33,1,34,1],[33,2,34,5],[33,6,34,6],[33,7,34,7],[33,8,34,8],[33,9,34,9],[33,10,34,10],[36,0,37,0],[36,1,37,1],[36,2,37,5],[36,6,37,6],[36,7,37,7],[36,8,37,8],[36,9,37,9],[36,10,37,10],[39,0,40,0],[39,1,40,1],[39,2,40,6],[43,0,48,0],[43,1,48,1],[43,2,44,2],[43,3,44,3],[43,4,44,4],[43,5,44,5],[45,2,46,2],[45,3,46,3],[45,4,46,4],[45,5,46,5],[47,2,48,2],[47,3,48,3],[47,4,48,4],[47,5,48,5],[51,0,54,0],[51,1,54,1],[51,2,54,2],[51,3,52,3],[51,4,52,4],[53,3,54,3],[53,4,54,4],[94,2,98,2],[99,2,103,2],[104,2,107,2],[110,2,119,2],[120,2,121,2]]}
[null,null,"ANEXO AySA - NOTAS EN CAMPOS CORRESPONDIENTES A \"MONTOS ORIGINAL\", \"MODIFICACIONES MONTO ORIGINAL\" Y \"MONTO VIGENTE\""]
[]
[]
["DIRECCION","NOTA","OC","CONTRATISTA","Revisión","Monto revisiones","Monto original con IVA Total OC","Monto Revisiones con IVA - Total OC","Monto vigente con IVA Total OC","Monto estimado inversiones sobre el monto vigente con IVA","Observaciones"]
["DRCF","NOTA 1",17305,"COMPANIA SUDAMERICANA DE GAS S.A.","Rev. 1 - ítems 13 al 24;Rev. 1 - ítems 25 al 30","3.389.147,7; 282.283,89",{"$f":"+I5-H5","v":13669562.389999997},{"$f":"(3389147.7+282283.89)*1.21","v":4442432.2239000006},18111994.613899998]
[null,"NOTA 2",17306,"CONSTRUCCIONES ZUBDESA S.A.","Rev. 1 Items 9 al 16. Rev 2 Items 17 al 20","$1.503.267,90;$ 117.073,47",6063180.5300000003,{"$f":"(1503267.9+117073.47)*1.21","v":1960613.0576999998},8023793.5877]
[null,"NOTA 3",20690,"CONSTRUCCIONES ZUBDESA S.A.","Rev. 1  ítems 25 al 32; Rev. 2  ítems 33 a 40; Rev 3 ítems 41 a 48; Rev. 4   ítems 49, 50 y 51- Se reduce monto ítems 9, 11, 17, 18 y 40;Rev. 6 items 52,53,54.","$654.958,02;$756.289,58;\n$1.303.101,49;0;21.041.820,68\n",55992515.501999989,{"$f":"(654958.02+756289.58+1303101.49+21041820.68)*1.21","v":28744965.421699997},84737480.92369999]
[null,"NOTA 4",20691,"COMPANIA SUDAMERICANA DE GAS S.A.","Rev. 1 ítem 25 a 27; Rev. 2 ítems 28 al 35;Rev. 3 ítems 51 al 58; Rev. 4 ítems 45 a 50;Rev. 5 ítems 51 a 58","$12.000.000;1.316.956,80;$1.587.171,06;$43.441.043;$3.085.787,72",93613715.808800012,{"$f":"(12000000+1316956.8+1587171.06+43441043+3085787.72)*1.21","v":74331459.881799996},167945175.69060001]
["DRO","NOTA 5",3997,"Construcciones Zubdesa S.A.","Rev 1. Items 9, 10 y 11;Rev.2 ítems n° 12, 13 y 14; Rev. 4 ítems N° 15 al 18;Rev. 5 Items 19 a 22.","$ 1.022.139; $ 326.643,00.-;$ 13.640.216,00;$ 346.776,00",26210235.920000002,{"$f":"(1022139+326643+13640216+346776)*1.21","v":18556286.539999999},44766522.460000001]
[null,"NOTA 6",17310,"Construcciones Zubdesa S.A.","Rev. 2 ítems 17 al 22;Rev. 3 ítems 23 al 30","$ 2.235.000.-; $201.975",13447670.17,{"$f":"(2235000+201975)*1.21","v":2948739.75},16396409.92,8721442.8399999999]
[null,"NOTA 7",11530,"APCO SA","Sin revision","Sin revision",{"$f":"+I11","v":332095.20849999995},0,332095.20849999995]
[null,"NOTA 8",17605,"Rowing SA","Sin revision","Sin revision",{"$f":"+I12","v":542789.53189999994},0,542789.53189999994]
[null,"NOTA 9",20694,"Construcciones Zubdesa S.A.","Rev. 1 ítem 41 a 60;Rev. 2 ítems 63 al 72;Rev. 3 ítems 73 y 74.;Rev. 4 ítems 77 y 78; Rev. 5 ítem 79 y 80","$1.325.141.;$ 907.443;$ 2.137.676;$ 1.554.174; $ 11.642.103",95550462.378800005,21255509.77,{"$f":"+G13+H13","v":116805972.1488},54760237.236099996]
[null,"NOTA 26",20695,"C&E Construcciones S.A.","Rev. 1 ítem 33 a 48;Rev. 2 ítems 49 al 56;Rev. 3 ítems 57 y 58.;Rev. 4 ítems 59 y 60","$695.535; $447.219; $1.029.435; $809.920",67316984.454500005,3608351.89,{"$f":"+G14+H14","v":70925336.344500005},37356369.228200004]
["DRSE","NOTA 10",4000,"APCO S.A.","Rev. 1 Items 4, 5 y 6;Rev.2 Items 7 a 9;Rev. 3 Items 10 a 12; Rev 4 Items 13 a 15;Rev 5 Ítems 16 a 27","11315457;$ 444,822.00;$12.850.000,00;$ 1.430.000,00;$ 539.479,53",{"$f":"+I15-H15","v":20464913.919999979},{"$f":"(11315457+444822+12850000+1430000+539479.53)*1.21","v":32161507.8213},52626421.741299979]
{"$rows_left_out":108}
{"sheet":"POR JURISDICCION","index":2,"n_rows":25,"n_cols":6,"rows_kept":25,"cut":false,"hidden":true,"merged":[[3,0,3,8],[14,1,15,8]]}
[]
[]
[]
["INVERSIÓN EN LA CMR AL 30 DE JUNIO DE 2019"]
[]
[null,"RECURSOS NETOS DEVENGADOS EN LA CMR"]
[]
[null,"CONCEPTO"," DEVENGADO 2016","DEVENGADO 2017","DEVENGADO TOTAL 2018","DEVENGADO 1° SEMESTRE 2019"]
[]
[null,"TOTAL DE RECURSOS DEVENGADOS",8074389911.1896057,15465161750.199099,21106376712.897976,12234074995.343378]
[null,"TRANSFERENCIAS ENTRE JURISDICCIONES*",-322947260,-2524242732,-2906354246,-2544026064]
[]
[null,"RECURSOS NETOS DEVENGADOS EN LA CMR",7751442651.1896057,12940919018.199099,18200022466.897976,9690048931.3433781]
[]
[null,"*NOTA: Con el objetivo de reflejar los recursos netos devengados en la CMR, este concepto contempla aquellos recursos devengados por una Jurisdicción en concepto de transferencias a otra a cargo de su ejecución y que, por ende, deben ser deducidos para evitar duplicaciones."]
{"$rows_left_out":11}
{"sheet":"Total de obras","index":3,"n_rows":846,"n_cols":54,"rows_kept":846,"cut":false,"hidden":false,"merged":[]}
[]
[null,"Inversiones Cuenca Matanza Riachuelo - Ejecución 2019"]
[]
[null,"ID","NIVEL","LA","TIPO DE \nACCIONES","AGRUPAMIENTO\nPOR OBRA/ACTIVIDAD","DENOMINACIÓN","NAT","JURISDICCIÓN","SAF","SUBJ./ SECRET./ ENTIDAD","PROGRAMA","SUB0PROG","PROYECTO","ACTIVIDAD","OBRA","F. FINANC.","INC","PPAL","PARC","SUB PARC","FI","FU","UG","TIPO DE ASIG","OBRA/ACT","ENTE EJECUTOR","MUNICIPIO","LOCALIDAD/\nCOMUNA","DIRECCIÓN DE LA OBRA","FECHA DE\nINICIO","FECHA DE\nFIN","MONTO\nORIGINAL","MODIFICACIONES MONTO ORIGINAL","OTRAS MODIFICACIONES MONTO ORIGINAL","MONTO\nVIGENTE","DEVENGADO ACUM 2006-2009","DEVENGADO\n2010","DEVENGADO\n2011","DEVENGADO\n2012","DEVENGADO\n2013","DEVENGADO\n2014","DEVENGADO\n2015","DEVENGADO\n2016 ","DEVENGADO\n2017","DEVENGADO\n2018","DEVENGADO\n2019","PRESUPUESTO\n 2019","PRESUPUESTO\n 2020","ESTADO","AVANCE FINANCIERO","AVANCE\nFÍSICO","OBSERVACIONES"," "]
[null,118,"1. ESTADO NACIONAL","09. EXPANSIÓN DE LA RED DE AGUA POTABLE Y SANEAMIENTO DE CLOACAS","EXPANSIÓN DE REDES DE AGUA","REDES DE AGUA LA MATANZA","PLAN YSA A + T DR. OESTE LA MATANZA",2,"91. OBLIGACIONES DEL TESORO",356,"AYSA","95. ASISTENCIA FINANCIERA A EMPRESAS PÚBLICAS Y ENTE BINACIONAL",5,"N848408",77,"-","22 Y RECURSOS PROPIOS",5,5,7,753,3,8,2,"2","SIN P3","-","LA MATANZA","LA MATANZA","A LUSITANO, A EL FORTÍN M4, CANILLAS COMUNITARIAS V. CELINA, FALTANTE LASALLE M2 Y SAN ENRIQUE M3 / AMPLIACION EL TALA M1 / CASTILLO CENTRO M3 / CRISTIANIA M6/ CRISTIANIA M7 / EL PORVENIR M2 / EL TAMBO M1 / EL TAMBO M2 / EMILIOZZI M3 / EMILIOZZI M4 / LA ABADIA M3 / LOS CEDROS 1 M1 A M7 / MI ESPERANZA M5 / PARQUE SARMIENTO M3 / SAN MARTIN M2 Y M3 / SAN ROQUE M3 / AMERICA M3 / LA ISLA M1 / MI ESPERANZA M11 - DORREGO M7 / ORO VERDE M4 / LUJAN M4 /GIARDINO M2 / DOREGO M6 / LOS CEDROS 2 M1 A M8 / SAN IGNACIO M3 Y M4 / CRISTIANIA M8 Y M9 / LOS CEDROS B M1 A M3 / A LA LOMA M3, A LAS NIEVES M3, A SANTA CLARA M2, INTERCONEXIÓN CISTERNA B° MUNICIPAL, 22 DE ENERO","2008-08-22","2009-08-10",11471411.869999999,47032.700000001118,9836568.3520000018,21355012.922000002,21562136.9397,363380.38270000002,29441.3207,5189.2906999999996,54152.594100000002,0,672793.85580000002,-16210.079599999999,21048.191999999999,1132.8625,9801,0,0,"FINALIZADO",1,1.0001716323354135,"EN 2018 SE MODIFICA EL CÓDIGO DE ACTIVIDAD DE LA APERTURA PROGRAMÁTICA DE 5 A 77, UG DE 96 A 2 Y FF DE 11 A 22. EL PROYECTO TAMBIÉN SERÁ FINANCIADO CON RECURSOS PROPIOS DE AYSA"," "]
[null,138,"1. ESTADO NACIONAL","09. EXPANSIÓN DE LA RED DE AGUA POTABLE Y SANEAMIENTO DE CLOACAS","GRANDES OBRAS DE INFRAESTRUCTURA CLOACALES","SISTEMA CLOACAS BERAZATEGUI","SIST. BERAZATEGUI PRIMERA ETAPA PLANTA DE PRETRATAMIENTO OBRA CIVIL Y ELECTROMECÁNICA",2,"91. OBLIGACIONES DEL TESORO",356,"AYSA","95. ASISTENCIA FINANCIERA A EMPRESAS PÚBLICAS Y ENTE BINACIONAL",5,"A861602/03",77,"-","22 Y RECURSOS PROPIOS",5,5,7,753,3,8,2,"2","SC497","-","BERAZATEGUI","BERAZATEGUI","EL PREDIO SE ENCUENTRA AL NOROESTE DEL PARTIDO DE BERAZATEGUI, CERCANO AL LÍMITE CON EL PARTIDO DE QUILMES, ENTRE LA AUTOPISTA BUENOS AIRES-LA PLATA Y LA COSTA DEL RÍO DE LA PLATA.","2009-01-05","2013-10-13",323100666.02899998,382961606.97100002,-37338947.597900033,668723325.40209997,97875162.540000007,111771771,93763688.599999994,152958259.02720001,94842103.924700007,42177118.285499997,19186671.372000001,53633974.0277,586180.25289999973,1914528.6105,-141082.128,27830000,0,"FINALIZADO",1,1,"EN 2018 SE MODIFICA EL CÓDIGO DE ACTIVIDAD DE LA APERTURA PROGRAMÁTICA DE 5 A 77, UG DE 96 A 2 Y FF DE 11 A 22. EL PROYECTO TAMBIÉN SERÁ FINANCIADO CON RECURSOS PROPIOS DE AYSA. AÑOS ANTERIORES EL PROYECTO FUE FINANCIADO POR PRÉSTAMO ANSES Y FUENTE 1.1. EL MONTO VIGENTE INCLUYE EL VALOR DEL CONTRATO ORIGINAL, + REDETERM. CONOCIDAS + ADDENDAS FIRMADAS + REDETERM. ESTIMADAS."," "]
[null,227,"2. PROVINCIA DE BS AS","08. URBANIZACIÓN DE VILLAS Y ASENTAMIENTOS URBANOS","VIVIENDAS NUEVAS","COMPLEJO LA MATANZA ","LA MATANZA 171 VIV",2,"42. INSTITUTO DE LA VIVIENDA","-","INSTITUTO DE LA VIVIENDA","14. PLAN FEDERAL DE CONSTRUCCION DE VIVIENDAS",2,6553,"-","1",12,6,3,1,99,12,"-",427,"1","-","MINISTERIO DE INFRAESTRUCTURA","LA MATANZA","GONZALEZ CATAN","LAVALLEJA Y DOBLAS","2017-04-11","2018-04-04",26929448.670000002,3004014.1699999981,0,29933462.84,1284155,2451338.9500000002,0,114671.74,948021.92,385747.94,0,152729.76999999999,103638.06,128027,554493.19999999995,0,{"$f":"VLOOKUP(B7,'[10]FINAL F'!$A:$AY,51,0)","v":26733576},"FINALIZADO",1,1,"-"," "]
[null,233,"2. PROVINCIA DE BS AS","08. URBANIZACIÓN DE VILLAS Y ASENTAMIENTOS URBANOS","VIVIENDAS NUEVAS","COMPLEJO LA MATANZA ","LA MATANZA 52 VIV - TERMINACIÓN DE 119 VIV. FECOVIMA",2,"42. INSTITUTO DE LA VIVIENDA","-","INSTITUTO DE LA VIVIENDA","5. SOLIDARIDAD",2,5601,"-","51",12,6,3,1,99,12,"-",427,"1","-","MINISTERIO DE INFRAESTRUCTURA","LA MATANZA","-","-","2006-06-21","2018-11-30",4046460.26,7507022.3099999996,0,11553483,9080768,3038525.65,1296943.8899999999,0,0,1776910.56,2889468.72,2224715.37,1726423.8399999999,199238.91999999998,2127671.46,0,{"$f":"VLOOKUP(B8,'[10]FINAL F'!$A:$AY,51,0)","v":0},"EN EJECUCIÓN",0.98803200000000002,0.99,"FALTA EL CIERRE ADMINISTRATIVO A 2018"," "]
[null,541,"1. ESTADO NACIONAL","08. URBANIZACIÓN DE VILLAS Y ASENTAMIENTOS URBANOS","VIVIENDAS NUEVAS","COMPLEJO BARRIO GENOVA ","Bº GENOVA - 73 VIV ",2,"30. MINISTERIO DEL INTERIOR, OBRAS PÚBLICAS Y VIVIENDA",325,"SECRETARIA DE VIVIENDA","71. URBANIZACIÓN DE VILLAS Y ASENTAMIENTOS PRECARIOS.","-","-","77.VIVIENDAS NUEVAS EN LA CUENCA MATANZA RIACHUELO","36/08",11,5,8,6,0,3,7,6,"1","-","-","AVELLANEDA","GÉNOVA","Bº GENOVA","2009-05-08","-",12418823.09,562026.56999999995,0,12980849.66,2810102.15,3648934.98,5229404.63,449720.32000000001,480251.7,0,5176311.8,9098029.0299999993,0,0,0,754782.23,0,"-",1,1,"-"," "]
[null,542,"1. ESTADO NACIONAL","08. URBANIZACIÓN DE VILLAS Y ASENTAMIENTOS URBANOS","VIVIENDAS NUEVAS","COMPLEJO BARRIO DOCK SUD","BARRIO DOCK SUD - 100 VIV",2,"30. MINISTERIO DEL INTERIOR, OBRAS PÚBLICAS Y VIVIENDA",354,"SECRETARIA DE VIVIENDA","46. URBANIZACIÓN DE VILLAS Y ASENTAMIENTOS PRECARIOS.","-","-","77.VIVIENDAS NUEVAS EN LA CUENCA MATANZA RIACHUELO","36/08",11,5,8,6,0,3,7,6,"1","-","-","AVELLANEDA","DOCK SUD ","Bº DOCK SUD","2009-05-15","2012-10-09",17289377.359999999,1286078.3999999999,0,18575455.759999998,4895843.0999999996,5497537.2699999996,6499386.5300000003,358830.36,1286078.3999999999,0,0,0,0,0,0,1543042.9720000001,0,"-",1,1,"-"," "]
[null,544,"1. ESTADO NACIONAL","08. URBANIZACIÓN DE VILLAS Y ASENTAMIENTOS URBANOS","VIVIENDAS NUEVAS","COMPLEJO BARRIO LA SALADITA","Bº LA SALADITA - 138 VIV ",2,"30. MINISTERIO DEL INTERIOR, OBRAS PÚBLICAS Y VIVIENDA",354,"SECRETARIA DE VIVIENDA","46. URBANIZACIÓN DE VILLAS Y ASENTAMIENTOS PRECARIOS.","-","-","77.VIVIENDAS NUEVAS EN LA CUENCA MATANZA RIACHUELO","36/08",11,5,8,6,0,3,7,6,"1","-","-","AVELLANEDA","LA SALADITA","Bº LA SALADITA","2009-05-08","-",18380473.82,9334297.5600000005,0,27714771.379999999,3561276.32,6920005.7400000002,6478024.1560000004,2964163.09,2728011.97,0,0,0,0,0,0,3120963.11,0,"-",1,0.05,"-"," "]
[null,563,"1. ESTADO NACIONAL","08. URBANIZACIÓN DE VILLAS Y ASENTAMIENTOS URBANOS","VIVIENDAS NUEVAS","COMPLEJO GRAL. PAZ Y CASTAÑARES ","220 DE 780 VIV - GRAL. PAZ Y CASTAÑARES ",2,"30. MINISTERIO DEL INTERIOR, OBRAS PÚBLICAS Y VIVIENDA",325,"SECRETARIA DE VIVIENDA","71. URBANIZACIÓN DE VILLAS Y ASENTAMIENTOS PRECARIOS.","-","-","77.VIVIENDAS NUEVAS EN LA CUENCA MATANZA RIACHUELO","251/2008",11,5,8,1,0,3,7,2,"1","-","-","CABA","-","GRAL. PAZ Y CASTAÑARES","-","-",193064501.00999999,28443612.100000001,0,221508113.10999998,54454090.025641002,0,0,17004403.23,25683459.129999999,32226198.52,6589922.6600000001,1586150.389,19806879.619999997,0,0,3541742.7,0,"EN ANÁLISIS",0.9859,0.91,"-"," "]
[null,610,"1. ESTADO NACIONAL","10. DESAGÜES PLUVIALES","CANALIZACIÓN","ARROYO DEL REY","OBRA - ARROYO DEL REY - PGA - OBRAS DE PRIMERA PRIORIDAD",2,"30. MINISTERIO DEL INTERIOR, OBRAS PÚBLICAS Y VIVIENDA",325,"SECRETARÍA DE INFRAESTRUCTURA Y POLÍTICA HÍDRICA","EXTRAPRESUPUESTARIO - FFIH - FONDO FIDUCIARIO INFRAESTRUCTURA HÍDRICA ","-","-","-","BUE085","FFIH","-","-","-","-","-","-","-",1,"-","SSRH","LOMAS DE ZAMORA","ING. BUDGE","REVESTIMIENTO DEL CAUCE DEL ARROYO DEL REY DESDE LA DESEMBOCADURA EN EL RÍO MATANZA HASTA CALLE GARIBALDI","2006-06-14","-",98688252.5,158561052.03999999,637698982.75999999,894948287.29999995,125165667.03,78957055.590000004,103088981.52,76815255.590000004,102134623.87,73266292.540000007,71068529.289999992,42080470.810000002,69070958.519999996,172256144.91,34938322.539999999,52999081.979999997,18060759.439999901,"FINALIZADO",0.9798,1,"-"," "]
[null,794,"1. ESTADO NACIONAL","06. PLAN SANITARIO DE EMERGENCIA","MEJORA Y MANTENIMIENTO","SISTEMA CLOACAS LA MATANZA","EQUIPAMIENTO ELECTROMECÁNICO",2,"91. OBLIGACIONES DEL TESORO",356,"AYSA","95. ASISTENCIA FINANCIERA A EMPRESAS PÚBLICAS Y ENTE BINACIONAL",5,"1055102",5,"-",11,5,5,7,753,3,8,96,"2","SIN P3","-","LA MATANZA","ALDO BONZI","PLANTA SUDOESTE - ANA MARÍA JANER Y PALPA - ALDO BONZI","2010-04-27","2011-05-01",2372104.5699999998,0,-541272.88159999973,1830831.6884000001,"-",1828740.4212,83229.051399999997,"-","-","-",0,-81137.517999999996,0,0,-19791.6312,0,0,"FINALIZADO",0.98918981393789607,1,"-"," "]
[null,1098,"2. PROVINCIA DE BS AS","08. URBANIZACIÓN DE VILLAS Y ASENTAMIENTOS URBANOS","VIVIENDAS NUEVAS","COMPLEJO MARCOS PAZ","MARCOS PAZ 202 VIV",2,"42. INSTITUTO DE LA VIVIENDA","-","INSTITUTO DE LA VIVIENDA","14. PLAN FEDERAL DE CONSTRUCCION DE VIVIENDAS",2,6554,"-","51",12,"-","-","-",1,"-","-",889,"1","-","MINISTERIO DE INFRAESTRUCTURA","MARCOS PAZ","MARCOS PAZ","-","2010-02-16","2019-07-31",36002468.310000002,0,0,36002468.310000002,0,6926402.0300000003,1049176,77190.89,0,0,0,0,8588633.0800000001,13463658,7980074.6200000001,0,{"$f":"VLOOKUP(B15,'[10]FINAL F'!$A:$AY,51,0)","v":0},"EN EJECUCIÓN",0.78,0.624,"-"," "]
{"$rows_left_out":832}
{"sheet":"Resumen total","index":4,"n_rows":14,"n_cols":7,"rows_kept":14,"cut":false,"hidden":false,"merged":[[13,1,15,6]]}
[]
[]
[null,"NIVEL","DEVENGADO\n2006-2016","DEVENGADO\n2017","DEVENGADO\n2018","DEVENGADO\n2019","PRESUPUESTO\n2020"]
[null,"1. ESTADO NACIONAL",31265635963,10538486355,15670173517,26532328227,40680165822]
[null,"2. PROVINCIA DE BS.AS",3118723292,2015901531,1530497713,1377058675,1490468746]
[null,"3. CABA",4047309601,1887831925,2146145174,5277240588,3725017203]
[null,"4. ACUMAR",3661503020,1022941939,1759560309,1428040161,1858977498]
[null,"TOTAL BRUTO DEVENGADO",{"$f":"SUM(C4:C7)","v":42093171876},{"$f":"SUM(D4:D7)","v":15465161750},{"$f":"SUM(E4:E7)","v":21106376713},{"$f":"SUM(F4:F7)","v":34614667651},{"$f":"SUM(G4:G7)","v":47754629269}]
[]
[null,"TRANSFERENCIAS ENTRE JURISDICCIONES¹",-1469407916,-2524242732,-2906354246,-8149202077.2799997,-8561738709]
[]
[null,"TOTAL NETO DEVENGADO",{"$f":"C8+C10","v":40623763960},{"$f":"D8+D10","v":12940919018},{"$f":"E8+E10","v":18200022467},{"$f":"F8+F10","v":26465465573.720001},{"$f":"G8+G10","v":39192890560}]
[]
[null,"¹ Con el objetivo de reflejar los recursos netos destinados a la CMR, se distinguió aquellos recursos devengados por una jurisdicción en concepto de transferencias a otra a cargo de su ejecución y que, por ende, deben ser deducidos para evitar duplicaciones."]

{"sheet":"Estado Nacional","index":5,"n_rows":14,"n_cols":6,"rows_kept":14,"cut":false,"hidden":false,"merged":[]}
[]
[]
[null,"NIVEL","DEVENGADO\n2017","DEVENGADO\n2018","DEVENGADO\n2019","PRESUPUESTO\n2020"]
[null," 1. ESTADO NACIONAL",{"$f":"SUM(C6:C14)","v":10538486354},{"$f":"SUM(D6:D14)","v":15670173517},26532328227,40680165822]
[]
[null,"AYSA",4743009134,8865408597,13628681513,27600344846]
[null,"SECRETARÍA DE INFRAESTRUCTURA Y\nPOLÍTICA HÍDRICA",203954840,572281157,224354072,398995833]
[null,"ENOHSA",38609226,23659702,2538942,2539775]
[null,"UNIDAD COORDINADORA GENERAL DEL PROYECTO BIRF 7706-AR",2639955237,3184367252,9404042635,9434954743]
[null,"SECRETARÍA DE INFRAESTRUCTURA URBANA",259136130,411077187,263522038,"S/d"]
[null,"SECRETARÍA DE PLANIFICACIÓN TERRITORIAL Y COORDINACIÓN DE OBRA PÚBLICA",303711930,38836706,0,0]
[null,"SECRETARÍA DE VIVIENDA",816919588,1221464186,1429709528,"S/d"]
[null,"DIRECCIÓN NACIONAL DE VIALIDAD",1474513480,1305692364,1557296913,3201826619]
[null,"UNIDAD COORDINADORA DE PROGRAMAS CON FINANCIAMIENTO EXTERNO",58676789,47386366,22182586,41504006]

{"sheet":"Provincia","index":6,"n_rows":10,"n_cols":6,"rows_kept":10,"cut":false,"hidden":false,"merged":[]}
[]
[]
[null,"NIVEL","DEVENGADO\n2017","DEVENGADO\n2018","DEVENGADO\n2019","PRESUPUESTO\n2020"]
[null," 2. PROVINCIA DE BS.AS",{"$f":"SUM(C6:C10)","v":2015901531},{"$f":"SUM(D6:D10)","v":1530497713},{"$f":"SUM(E6:E10)","v":1377058675},{"$f":"SUM(F6:F10)","v":1490468746}]
[]
[null,"DIRECCIÓN DE VIALIDAD",130425093,0,0,0]
[null,"DIRECCIÓN GENERAL DE CULTURA Y EDUCACIÓN",30363889,0,0,0]
[null,"INSTITUTO DE LA VIVIENDA",678845226,424678952,347565306,119952822]
[null,"MINISTERIO DE INFRAESTRUCTURA",1176267323,1105818761,1029493369,1370515924]
[null,"MINISTERIO DE LA PRODUCCIÓN",0,0,0,0]

{"sheet":"CABA","index":7,"n_rows":18,"n_cols":6,"rows_kept":18,"cut":false,"hidden":false,"merged":[]}
[]
[]
[null,"NIVEL","DEVENGADO\n2017","DEVENGADO\n2018","DEVENGADO\n2019","PRESUPUESTO\n2020"]
[null," 3. CABA",{"$f":"SUM(C6:C18)","v":1887831925},{"$f":"SUM(D6:D18)","v":2146145172},5277240588,3725017203]
[]
[null,"JEFATURA DE GABINETE DE MINISTROS",0,0,0,0]
[null,"INSTITUTO DE VIVIENDA",893906476,636633707,3355809736,2170064444]
[null,"AUTOPISTAS URBANAS S.A.",213228486,406206187,260514514,0]
[null,"CORPORACIÓN BUENOS AIRES SUR S.E.",124791297,83148831,99850290,139446625]
[null,"MINISTERIO DE DESARROLLO URBANO Y TRANSPORTE",219162287,122664973,281779289,135561309]
[null,"MINISTERIO DE AMBIENTE Y ESPACIO PÚBLICO",103879113,346047361,346891308,574894357]
[null,"AGENCIA DE PROTECCIÓN AMBIENTAL",12260829,6581268,7453565,4340990]
[null,"MINISTERIO DE DESARROLLO ECONÓMICO",0,0,0]
[null,"MINISTERIO DE EDUCACIÓN",48200997,17240906,7880006,0]
[null,"MINISTERIO DE GOBIERNO",59341702,64009764,69329960,1740000]
{"$rows_left_out":4}
{"sheet":"ACUMAR","index":8,"n_rows":19,"n_cols":6,"rows_kept":19,"cut":false,"hidden":false,"merged":[]}
[]
[]
[null,"NIVEL","DEVENGADO\n2017","DEVENGADO\n2018","DEVENGADO\n2019","PRESUPUESTO\n2020"]
[null," 4. ACUMAR",{"$f":"SUM(C6:C19)","v":1022941939},{"$f":"SUM(D6:D19)","v":1902976903},{"$f":"SUM(E6:E19)","v":1428040161},1858977498]
[]
[null,"SISTEMA DE INDICADORES",0,0,0,0]
[null,"SISTEMA DE INFORMACIÓN PÚBLICA",331371,580400,0,10318000]
[null,"FORTALECIMIENTO INSTITUCIONAL",540068615,652851293,792669085,1009740530]
[null,"ORDENAMIENTO AMBIENTAL DEL TERRITORIO",4931460,144775889,0,59979095]
[null,"EDUCACIÓN AMBIENTAL",6433984,11442841,287250,0]
[null,"PLAN SANITARIO DE EMERGENCIA",23657094,12940887,26934250,41148498]
[null,"MONITOREO DE CALIDAD DE AGUA, SEDIMENTOS Y AIRE",30644105,33699508,14579392,101007375]
[null,"URBANIZACIÓN DE VILLAS Y ASENTAMIENTOS PRECARIOS",2612013,142836196,32226298,15600000]
[null,"EXPANSIÓN DE LA RED DE AGUA POTABLE Y SANEAMIENTO CLOACAL",0,"$ 0",0,9400000]
[null,"DESAGUES PLUVIALES",0,2336319,3468774,6666000]
{"$rows_left_out":5}
{"sheet":"Hoja1","index":9,"n_rows":13,"n_cols":8,"rows_kept":13,"cut":false,"hidden":true,"merged":[]}
[]
[]
[null,null,null,null,"Obras\ninformadas","Obras\nquitadas","Obras con ejecución"]
[null,null,null,"VIALIDAD",8,0,2]
[null,null,null,"ENOHSA",4,0,2]
[null,null,null,"UNIDAD C.",10,0,4]
[null,null,null,"BIRF 7706",17,0,13]
[null,null,null,"HÍDRICOS",6,0,6]
[null,null,null,"VIVIENDA",111,0,23]
[null,null,null,"HABITAT",44,0,22]
[null,null,null,"AYSA",185,181,null,"4 a revisar"]
[null,null,null,"CABA",118,117,null,7809]
[null,null,null,"PBA",113]

{"sheet":"CLASIFICACIÓN MANUAL","index":10,"n_rows":62,"n_cols":3,"rows_kept":62,"cut":false,"hidden":true,"merged":[]}
[null,null,"CLASIFICACIÓN"]
["01. SISTEMA DE INDICADORES","FORTALECIMIENTO DEL SISTEMA DE INDICADORES DE ACUMAR","SERVICIO"]
["02. SISTEMA DE INFORMACIÓN PÚBLICA","FORTALECIMIENTO DEL SISTEMA DE INFORMACIÓN PÚBLICA DE ACUMAR","SERVICIO"]
["03. FORTALECIMIENTO INSTITUCIONAL","FORTALECIMIENTO INSTITUCIONAL DE ACUMAR","SERVICIO"]
["04. ORDENAMIENTO TERRITORIAL","GENERACIÓN DE ESPACIOS VERDES","OBRA"]
["04. ORDENAMIENTO TERRITORIAL","OBRAS VIALES ESTRATÉGICAS","OBRA"]
["04. ORDENAMIENTO TERRITORIAL","ACCIONES EN ÁREAS DE ESPECIAL MANEJO","OBRA"]
["05. EDUCACIÓN AMBIENTAL","CAMPAÑA DE EDUCACIÓN AMBIENTAL","ACTIVIDAD"]
["05. EDUCACIÓN AMBIENTAL","CAPACITACIÓN EN EDUCACIÓN AMBIENTAL","ACTIVIDAD"]
["05. EDUCACIÓN AMBIENTAL","NUEVO CENTRO EDUCATIVO","OBRA"]
["06. PLAN SANITARIO DE EMERGENCIA","NUEVO EFECTOR DE SALUD ","OBRA"]
["06. PLAN SANITARIO DE EMERGENCIA","MEJORA EN EFECTOR DE SALUD","OBRA"]
["06. PLAN SANITARIO DE EMERGENCIA","EQUIPAMIENTO PARA EFECTOR DE SALUD","ACTIVIDAD"]
["06. PLAN SANITARIO DE EMERGENCIA","CAMPAÑA DE PREVENCIÓN","ACTIVIDAD"]
["06. PLAN SANITARIO DE EMERGENCIA","CAMPAÑA DE VACUNACIÓN","ACTIVIDAD"]
{"$rows_left_out":48}
{"sheet":"Resumen por LA","index":11,"n_rows":21,"n_cols":2,"rows_kept":21,"cut":false,"hidden":true,"merged":[]}
[]
[]
[]
[null,"LINEA DE ACCIÓN"]
[null," 03. FORTALECIMIENTO INSTITUCIONAL"]
[null,"02. SISTEMA DE INFORMACIÓN"]
[null,"SISTEMA DE INFORMACIÓN PÚBLICA"]
[null,"SISTEMA DE INFORMACIÓN PÚBLICA"]
[null,"SERVICIO DE MONITOREO DE MEDIOS.-"]
[null,"03. FORTALECIMIENTO INSTITUCIONAL"]
[null,"04. ORDENAMIENTO TERRITORIAL"]
[null,"05. EDUCACIÓN AMBIENTAL"]
[null,"06. PLAN SANITARIO DE EMERGENCIA"]
[null,"07. MONITOREO DE LA CALIDAD DE AGUA, SEDIMENTOS Y AIRE"]
[null,"08. URBANIZACIÓN DE VILLAS Y ASENTAMIENTOS URBANOS"]
{"$rows_left_out":6}